{"text_format":"1","workbook":"xlsx","n_sheets":6,"sheets":["Explications","FICHE évaluateur","FICHE CLUB","SYNTHESE","CORINNE","Feuil3"],"not_rendered":{"charts":5,"images":5,"macros":1,"external_links":0,"defined_names":11,"comments":0,"pivot_tables":0},"unopened":[],"bounds":{"document_bytes":16777216,"sheet_cells":100000,"rows_first":2000,"rows_last":500,"rows_between":2000,"halvings":0,"cell_chars":16384,"cell_head_chars":4096},"cells_cut":0,"cells_raw":0,"read":"whole","date_system":"1900"}

{"sheet":"Explications","index":0,"n_rows":49,"n_cols":6,"rows_kept":49,"cut":false,"hidden":false,"merged":[[31,2,31,3],[28,2,28,4],[48,2,48,4],[15,3,15,4],[22,0,22,1],[33,0,33,1],[47,2,47,3],[16,2,16,4],[27,3,27,4],[46,2,46,4],[25,3,25,4],[30,3,30,4],[29,2,29,3],[19,2,19,3],[20,3,20,4],[34,2,34,4],[35,2,35,4],[41,5,44,5],[39,3,39,4],[40,2,40,4],[0,0,0,5],[38,0,38,1],[3,0,3,1],[13,2,13,4],[12,2,12,4],[1,0,1,5],[5,2,5,4],[17,2,17,4],[7,2,11,2],[7,3,11,3],[7,4,11,4],[36,2,36,5],[14,2,14,4]]}
["LABEL SENIORS"]
["Cette page à pour objectif de vous expliquer toutes les questions et de vous apporter, si besoin, un complément d'informations. \nVous pouvez également voir les critères en fonction des 3 niveaux de label (les questions avec une * sont les critères incontournables pour tous les niveaux)\nVous pouvez rentrer vos réponses dans l'onglet \"FICHE CLUB\" ou l'évaluation se fait automatiquement et retourner ensuite le document avant le 15 janvier 2019 à cranque@lfna.fff.fr\nMême si le fichier vous indique que vous êtes non éligible, merci de nous retourner le document quand même, car ce qui compte c'est le jour de la visite. \nCela vous laisse ainsi plus de temps pour par exemple passer les formations incontournables"]
[]
["1 - Projet ASSOCIATIF",null,"ESPOIR","EXCELLENCE ","ELITE","COMMENTAIRES"]
[1,"Nombre de licenciés (U19, Seniors et vétérans, garçons et filles) *","18 licenciés (es) par équipe","22 licenciés (es) par équipe","25 licenciés (es) par équipe","Merci de noter votre nombre de licenciés garçons et filles U19, Senior et Vétérans. Vous retrouvez cette donnée dans Footclubs rubrique \"Licence\" puis \"statistiques\""]
[2,"Dirigeants licenciés (accompagnateurs) PAR EQUIPES le week-end *","2 dirigeants par équipe",null,null,"C'est vraiment l'accompagnateur qui suit l'équipe le week-end (il doit être licencié au club et être intégré, si possible, dans l'organigramme du club). Toutes les équipes Seniors du club doivent avoir 2 accompaganteurs dirigeants licenciés dans le club"]
[3,"Nombre DIRIGEANTES dans le club *","15% du nombre de dirigeants","20% du nombre de dirigeants","25% du nombre de dirigeants","Merci de noter votre nombre de licenciés dirigeantes. Vous retrouvez cette donnée dans Footclubs rubrique \"Licence\" puis \"statistiques\". La féminisation du football et surtout la prise de licence des nombreuses femmes qui entourent et donnent un coup de main au club est important."]
[4,"Nombre de licenciés joueurs joueuses total du club *","20 % : Ratio nombre de dirigeants + Educateurs / licenciés total","22 % : Ratio nombre de dirigeants + Educateurs / licenciés total","25 % : Ratio nombre de dirigeants + Educateurs / licenciés total","Merci de noter votre nombre de licenciés joueurs joueuses toutes catégories confondu (de U6 à vétérans, libre futsal….). Vous retrouvez cette donnée dans Footclubs rubrique \"Licence\" puis \"statistiques\""]
[5,"Nombre de DIRIGEANTS dans le club *",null,null,null,"Merci de noter votre nombre de licenciés dirigeants sans compter les diriegantes. Vous retrouvez cette donnée dans Footclubs rubrique \"Licence\" puis \"statistiques\""]
[6,"Combien d'éducateurs ayant une licence TECHNIQUE le club possède-t-il ? *",null,null,null,"Merci de noter votre nombre de licenciés Technique (personnes possédant un diplôme du type DES, BEF ou BMF). Vous retrouvez cette donnée dans Footclubs rubrique \"Licence\" puis \"statistiques\""]
[7,"Combien d'éducateurs ayant une licence TECHNIQUE FEDERALE le club possède-t-il ? *",null,null,null,"Merci de noter votre nombre de licenciés Technique Fédérale (personnes possédant un diplôme du type CFF1, CFF2, CFF3 ou anciennes versions). Vous retrouvez cette donnée dans Footclubs rubrique \"Licence\" puis \"statistiques\""]
[8,"Combien d'éducateurs ayant une licence ANIMATEUR le club possède-t-il ? *",null,null,null,"Merci de noter votre nombre de licenciés Animateurs (personnes ayant passé un module de formation du type Module U7, . Vous retrouvez cette donnée dans Footclubs rubrique \"Licence\" puis \"statistiques\""]
[9,"Il y a-t-il un défibrilateur cardiaque à proximité des terrains ? (moins de 5 min) *","Oui",null,null,"Cet équipement essentiel pour la sécurité de vos licenciés doit être à moins de 5 min des terrains. Les Communes ont une obligation de mise en place"]
[10,"Le club dispose-t-il d'une salle de convivialité ? *","Oui",null,null,"Le club house est essentiel dans la vie d'un club, il existe des aides au niveau fédéral pour les constructions ou autre (FAFA)"]
[11,"Le club est-il régulièrement représenté aux réunions organisées par les instances fédérales (Ligue et District) ? *","Oui",null,null,"Ce type de réunion vous permet d'obtenir des informations importantes sur différents thèmes"]
[12,"Le club organise-t-il des réunions de coordination général (déplacements, repas…) ?","Non","Oui",null,"Vous devrez fournir des PV, ordre du jour ou autre. Le PV est une trace écrite de ce qui est dit en rénion. Il vous aidera en cas de difficulté au sein du club"]
[13,"Le club a-t-il un organigramme général du club affiché dans le club house ? *","Oui",null,null,"L'organigramme est un élément essentiel dans la structuration du club. En l'affichant dans votre lieu de vie, cela vous assure que toutes personnes soient au courant de votre organisation."]
[14,"Le club met-il en place des manifestations extra sportives (loto, repas…) ? *","Oui",null,null,"Les manifestations extrasportives sont souvent incontournables pour gagner un peu d'argent. Merci de fournir affiches ou photos…"]
[15,"Le club a-t'il obtenu le label jeune ?","Non","Autodiagnostic","Oui","Le label jeunes et là aussi une aide à la structuration de l'ensemble de votre club. La première étape est un diagnostic qui vous permet de connaître les points à améliorer et vos points forts. Un accompagnement personnalisé est fait."]
[16,"Le club est-il en règle avec le statut des jeunes ?","Non",null,"Oui","Avoir des jeunes dans son club s'est assurer la pérénité du club"]
{"$rows_left_out":30}
{"sheet":"FICHE évaluateur","index":1,"n_rows":131,"n_cols":15,"rows_kept":131,"cut":false,"hidden":true,"merged":[[95,6,95,10],[93,6,93,10],[105,2,105,4],[105,6,105,10],[111,2,111,4],[97,2,97,4],[114,4,114,10],[116,1,116,2],[116,4,116,6],[111,6,111,10],[93,2,93,4],[102,1,102,10],[100,1,100,10],[107,6,107,10],[108,1,108,10],[109,2,109,4],[109,6,109,10],[40,2,40,4],[40,6,40,10],[41,1,41,10],[42,2,42,4],[91,2,91,4],[91,6,91,10],[97,6,97,10],[67,6,67,10],[69,2,69,4],[69,6,69,10],[71,2,71,4],[71,6,71,10],[82,6,82,10],[84,2,84,4],[84,6,84,10],[68,1,68,10],[70,1,70,10],[74,1,74,10],[82,2,82,4],[73,2,73,4],[73,6,73,10],[72,1,72,10],[75,6,75,10],[95,2,95,4],[42,6,42,10],[43,1,43,10],[44,2,44,4],[44,6,44,10],[64,1,64,10],[52,6,52,10],[54,2,54,4],[60,1,60,10],[61,2,61,4],[52,2,52,4],[63,6,63,10],[48,2,48,4],[48,6,48,10],[50,2,50,4],[50,6,50,10],[45,1,45,10],[46,2,46,4],[46,6,46,10],[47,1,47,10],[59,6,59,10],[0,0,0,10],[23,1,23,10],[22,2,22,4],[22,6,22,10],[4,3,4,8],[24,2,24,4],[25,1,25,10],[21,1,21,10],[29,1,29,10],[24,6,24,10],[26,2,26,4],[26,6,26,10],[28,2,28,4],[28,6,28,10],[15,0,15,1],[17,0,17,1],[6,3,6,8],[27,1,27,10],[2,3,2,8],[8,3,8,8],[89,2,89,4],[89,6,89,10],[75,2,75,4],[67,2,67,4],[80,2,80,4],[80,6,80,10],[61,6,61,10],[63,2,63,4],[66,1,66,10],[62,1,62,10],[30,6,30,10],[30,2,30,4],[31,1,31,10],[15,2,15,4],[15,5,15,6],[15,7,15,10],[17,2,17,4],[17,6,17,10],[122,0,122,4],[65,2,65,4],[65,6,65,10],[54,6,54,10],[58,1,58,10],[59,2,59,4],[38,2,38,4],[38,6,38,10],[36,2,36,4],[36,6,36,10],[34,2,34,4],[34,6,34,10],[32,2,32,4],[32,6,32,10],[33,1,33,10],[83,1,83,10],[124,0,124,4],[130,0,130,10],[131,0,131,10],[119,0,119,10],[116,8,116,10],[110,1,110,10],[99,2,99,4],[99,6,99,10],[101,2,101,4],[101,6,101,10],[103,2,103,4],[103,6,103,10],[107,2,107,4]]}
["LABEL SENIOR\nLFNA - Saison 2018/2019"]
[]
["N° affiliation :",null,null,{"$f":"'FICHE CLUB'!$E$3","v":0}]
[]
["Nom du club :",null,null,{"$f":"'FICHE CLUB'!$T$3","v":""}]
[]
["District :",null,null,{"$f":"'FICHE CLUB'!$A$5","v":""},null,null,null,null,null,null,null,null,null,{"$f":"VLOOKUP(District,Feuil3!F1:G12,2)","v":{"$error":"#N/A"}}]
[]
["Type de club :",null,null,{"$f":"'FICHE CLUB'!$T$5","v":""}]
[]
["Niveau de compétition du club :"]
["Régional",null,null,"R1",{"$f":"'FICHE CLUB'!$E$8","v":0},"R2",{"$f":"'FICHE CLUB'!$G$8","v":0},"R3",{"$f":"'FICHE CLUB'!$I$8","v":0},null,null,null,null,{"$f":"IF(E12=\"x\",D12,IF(G12=\"x\",F12,IF(I12=\"x\",H12,IF(D14=\"x\",C14,IF(F14=\"x\",E14,IF(H14=\"x\",G14,IF(K14=\"x\",J14,\"\")))))))","v":""}]
[]
["District",null,"D1",{"$f":"'FICHE CLUB'!$S$8","v":0},"D2",{"$f":"'FICHE CLUB'!$U$8","v":0},"D3",{"$f":"'FICHE CLUB'!$W$8","v":0},null,"D4 ou +",{"$f":"'FICHE CLUB'!$Y$8","v":0}]
["Coordonnées de la personne qui suit le dossier label Seniors dans le club :"]
["Nom :",null,{"$f":"'FICHE CLUB'!$D$11","v":0},null,null,"Prénom :",null,{"$f":"'FICHE CLUB'!$L$11","v":0}]
[]
["Tel :",null,{"$f":"'FICHE CLUB'!$T$11","v":0},null,null,"Mail :",{"$f":"'FICHE CLUB'!$AA$11","v":0}]
[]
["1 - PROJET ASSOCIATIF",null,null,null,null,null,null,null,null,null,null,null,{"$f":"MIN(M23:M55)","v":0}]
{"$rows_left_out":112}
{"sheet":"FICHE CLUB","index":2,"n_rows":116,"n_cols":35,"rows_kept":116,"cut":false,"hidden":false,"merged":[[4,0,4,14],[4,19,4,24],[18,2,18,16],[16,2,16,25],[0,1,0,28],[2,4,2,7],[2,19,2,28],[10,3,10,8],[10,11,10,16],[10,19,10,23],[10,26,10,28],[10,9,10,10],[10,24,10,25],[10,17,10,18],[10,0,10,2],[20,28,28,28],[22,27,28,27],[70,2,70,16],[78,2,78,16],[24,2,24,21],[28,2,28,21],[30,2,30,21],[72,2,72,21],[26,2,26,25],[82,2,82,16],[84,2,84,16],[86,2,86,16],[88,2,88,16],[116,1,116,28],[111,11,111,13],[111,17,111,18],[113,11,113,13],[113,17,113,18],[115,1,115,28],[104,20,104,21],[106,20,106,21],[108,20,108,21],[96,2,96,16],[104,4,104,5],[106,4,106,5],[114,0,114,28],[104,13,104,14],[106,13,106,14],[102,0,102,29],[106,26,106,28],[108,4,108,5],[108,13,108,14],[108,25,108,26],[108,16,108,19],[106,6,106,12],[108,6,108,12],[104,23,104,26],[104,15,104,19],[106,15,106,19]]}
[null,"LABEL SENIORS\nLFNA - Saison 2018/2019 ",null,null,null,null,null,null,null,null,null,null,null,null,null,null,null,null,null,null,null,null,null,null,null,null,null,null,null,null,null,"OUI","NON"]
[null,null,null,null,null,null,null,null,null,null,null,null,null,null,null,null,null,null,null,null,null,null,null,null,null,null,null,null,null,null,null,"NON",2]
["N° affiliation :",null,null,null,null,null,null,null,null,null,null,null,null,null,null,null,"Nom du club :",null,null,{"$f":"IFERROR(VLOOKUP(E3,Feuil3!$A:$C,2),\"\")","v":""},null,null,null,null,null,null,null,null,null,null,null,"Autodiagnostic","3 ou plus"]
[]
[{"$f":"IFERROR(VLOOKUP(E3,Feuil3!$A:$C,3),\"\")","v":""},null,null,null,null,null,null,null,null,null,null,null,null,null,null,{"$f":"VLOOKUP(A5,Feuil3!F1:G12,2)","v":{"$error":"#N/A"}},"Type de club :",null,null,{"$f":"IFERROR(VLOOKUP(E3,Feuil3!A:D,4),\"\")","v":""},null,null,null,null,null,null,null,null,null,null,null,"X"," "]
[]
["Niveau de compétition du club :"]
["Régional",null,null,"R1",null,"R2",null,"R3",null,null,null,null,null,null,null,null,"District","D1",null,"D2",null,"D3",null,"D4 ou +",null,null,null,null,null,null,null,null,null,{"$f":"IF(E8=\"x\",D8,IF(G8=\"x\",F8,IF(I8=\"x\",H8,IF(S8=\"x\",R8,IF(U8=\"x\",T8,IF(W8=\"x\",V8,IF(Y8=\"x\",X8,\"\")))))))","v":""}]
[]
["Coordonnées de la personne qui suit le dossier label Seniors dans le club :"]
["Nom :",null,null,null,null,null,null,null,null,"Prénom :",null,null,null,null,null,null,null,"Tél :",null,null,null,null,null,null,"Mail :",null,null,null,null,null,null,null,null,{"$f":"IF(E11=\"x\",D11,IF(G11=\"x\",F11,IF(I11=\"x\",H11,IF(S11=\"x\",R11,IF(U11=\"x\",T11,IF(W11=\"x\",V11,IF(Y11=\"x\",X11,\"\")))))))","v":""}]
[]
[null,"1 - PROJET ASSOCIATIF",null,null,null,null,null,null,null,null,null,null,null,null,null,null,null,null,null,null,null,null,null,null,null,null,"Résultat",null,"Niveau",null,null,{"$f":"MIN(AF15:AF45)","v":0}]
[]
[null,1,"Combien de licenciés (es) U19, Seniors et vétérans le club possède-t-il ? *",null,null,null,null,null,null,null,null,null,null,null,null,null,null,null,null,null,null,null,null,null,null,null,null,{"$f":"(AA15/AA51)","v":{"$error":"#DIV/0!"}},{"$f":"IFERROR(IF(AB15>=25,\"Elite\",IF(AB15>=22,\"Excellence\",IF(AB15>=18,\"Espoir\",\"Non éligible\"))),\"\")","v":""},null,null,{"$f":"IF(AC15=\"Elite\",3,IF(AC15=\"Excellence\",2,IF(AC15=\"Espoir\",1,0)))","v":0}]
[]
[null,2,"Combien de dirigeants licenciés (accompaganteurs) PAR EQUIPES le club a-t-il les week-end ?*",null,null,null,null,null,null,null,null,null,null,null,null,null,null,null,null,null,null,null,null,null,null,null,null,null,{"$f":"IFERROR(IF(AA17>=2,\"Elite\",\"Non éligible\"),\"\")","v":"Non éligible"},null,null,{"$f":"IF(AC17=\"Elite\",3,IF(AC17=\"Excellence\",2,IF(AC17=\"Espoir\",1,0)))","v":0}]
[]
[null,3,"Combien de DIRIGEANTES licenciées le club possède-t-il ?*",null,null,null,null,null,null,null,null,null,null,null,null,null,null,null,null,null,null,null,null,null,null,null,null,{"$f":"(+AA19/AA23)","v":{"$error":"#DIV/0!"}},{"$f":"IFERROR(IF(AB19>=25%,\"Elite\",IF(AB19>=20%,\"Excellence\",IF(AB19>=15%,\"Espoir\",\"Non éligible\"))),\"\")","v":""},null,null,{"$f":"IF(AC19=\"Elite\",3,IF(AC19=\"Excellence\",2,IF(AC19=\"Espoir\",1,0)))","v":0}]
[]
{"$rows_left_out":97}
{"sheet":"SYNTHESE","index":3,"n_rows":57,"n_cols":3,"rows_kept":57,"cut":false,"hidden":false,"merged":[[39,0,39,8],[29,0,29,8],[16,0,16,8],[1,0,1,8],[0,2,0,8],[0,0,0,1]]}
["SYNTHESE LABEL JEUNE",null,{"$f":"'FICHE évaluateur'!$D$5","v":""}]
["1 - PROJET ASSOCIATIF"]
["Nbe licénciés(es)",{"$f":"'FICHE CLUB'!$AF$15","v":0}]
["Dirigeants / équipe",{"$f":"'FICHE CLUB'!$AF$17","v":0}]
["Nbe dirigeantes",{"$f":"'FICHE CLUB'!$AF$19","v":0}]
["Ratio dirigeants / licenciés",{"$f":"'FICHE CLUB'!$AF$23","v":0}]
["Défibrilateur",{"$f":"'FICHE CLUB'!$AF$31","v":0}]
["Club House",{"$f":"'FICHE CLUB'!$AF$33","v":0}]
["Représentation",{"$f":"'FICHE CLUB'!$AF$35","v":0}]
["Coordination",{"$f":"'FICHE CLUB'!$AF$37","v":1}]
["Organigramme",{"$f":"'FICHE CLUB'!$AF$39","v":0}]
["Manifestations extra sportives",{"$f":"'FICHE CLUB'!$AF$41","v":0}]
["Label jeune",{"$f":"'FICHE CLUB'!$AF$43","v":1}]
["Statut des jeunes",{"$f":"'FICHE CLUB'!$AF$45","v":2}]
["Facebook",{"$f":"'FICHE CLUB'!$AF$47","v":2}]
[]
["2 - PROJET SPORTIF"]
["Nbe équipe",{"$f":"'FICHE CLUB'!$AF$51","v":0}]
["Nbe entrainement",{"$f":"'FICHE CLUB'!$AF$53","v":0}]
["Programmation",{"$f":"'FICHE CLUB'!$AF$55","v":1}]
{"$rows_left_out":38}
{"sheet":"CORINNE","index":4,"n_rows":11,"n_cols":54,"rows_kept":11,"cut":false,"hidden":true,"merged":[[8,29,8,37],[8,38,8,40],[8,41,8,52],[0,0,0,4],[8,0,8,11],[8,12,8,28],[7,0,7,4]]}
["Ligne pour envoi au district (tableau Districts)"]
["Numéro club","Retour club du doc label","Date d'envoi au Districts","N° district","Nom du club","Nom","Prénom","Tel","Mail","Thème de visite","Observations complémentaires"]
[{"$f":"'FICHE CLUB'!$E$3","v":0},"x",null,{"$f":"'FICHE CLUB'!$P$5","v":{"$error":"#N/A"}},{"$f":"'FICHE CLUB'!$T$3","v":""},{"$f":"'FICHE CLUB'!$D$11","v":0},{"$f":"'FICHE CLUB'!$L$11","v":0},{"$f":"'FICHE CLUB'!$T$11","v":0},{"$f":"'FICHE CLUB'!$AA$11","v":0},{"$f":"'FICHE CLUB'!$AG$105","v":""},{"$f":"'FICHE CLUB'!$B$117","v":0}]
[]
[]
[]
[]
["Ligne RETOUR DISTRICT"]
["DONNEES GENERALES",null,null,null,null,null,null,null,null,null,null,null,"ASSO",null,null,null,null,null,null,null,null,null,null,null,null,null,null,null,null,"SPORTIF",null,null,null,null,null,null,null,null,"EDUCATIF",null,null,"ENCADREMENT ET FORMATION"]
["Numéro d'affiliation","Retour visite","Date de visite","N° Dsitrict","Nom du club","Type de club","niveau club","visite faite par","personnes présentes","date de visite","Traitement hème","niveau de label","Joueurs U19 S V","Dirigeants / équipe","Dirigeantes","Joueurs ttes cat","Dirigeants","Technique","Technique Fédé","Animateur","Défibrilateur","Club House","Représentation","Coordination","Organigramme","Manifestations extra sportives","Label jeune","Statut des jeunes","Facebook","Nbe équipe","Nbe entrainement","Programmation","Réunions techniques","Terrains","Spé GB","Médical","Pratiques diversifiées","Féminines","Chartre","Arbitrage","Cas disciplinaires","Responsable T","Référent arbitrage","Entraineur 1ère ","Entraineur réserve","Entraineur 3","Entraineur GB","Nombre dirigeants formés","Président Secretaire…","Statut éduc","Nbe d'arbitre","Nbe arbitre F","Licences","Observation complémentaires"]
[{"$f":"'FICHE évaluateur'!$D$3","v":0},"x",{"$f":"'FICHE évaluateur'!$N$117","v":""},{"$f":"'FICHE évaluateur'!$N$7","v":{"$error":"#N/A"}},{"$f":"'FICHE évaluateur'!$D$5","v":""},{"$f":"'FICHE évaluateur'!$D$9","v":""},{"$f":"'FICHE évaluateur'!$N$12","v":""},{"$f":"'FICHE évaluateur'!$E$115","v":0},{"$f":"'FICHE évaluateur'!$A$120","v":0},{"$f":"'FICHE évaluateur'!$N$117","v":""},{"$f":"'FICHE évaluateur'!$A$125","v":0},{"$f":"'FICHE évaluateur'!$N$127","v":"Non éligible"},{"$f":"'FICHE évaluateur'!$C$23","v":0},{"$f":"'FICHE évaluateur'!$C$25","v":0},{"$f":"'FICHE évaluateur'!$C$27","v":0},{"$f":"'FICHE évaluateur'!$C$29","v":0},{"$f":"'FICHE évaluateur'!$C$31","v":0},{"$f":"'FICHE évaluateur'!$C$33","v":0},{"$f":"'FICHE évaluateur'!$C$35","v":0},{"$f":"'FICHE évaluateur'!$C$37","v":0},{"$f":"IF('FICHE évaluateur'!$C$39=\"OUI\",1,0)","v":0},{"$f":"IF('FICHE évaluateur'!$C$41=\"OUI\",1,0)","v":0},{"$f":"IF('FICHE évaluateur'!$C$43=\"OUI\",1,0)","v":0},{"$f":"IF('FICHE évaluateur'!$C$45=\"OUI\",1,0)","v":0},{"$f":"IF('FICHE évaluateur'!$C$47=\"OUI\",1,0)","v":0},{"$f":"IF('FICHE évaluateur'!$C$49=\"OUI\",1,0)","v":0},{"$f":"'FICHE évaluateur'!$C$51","v":0},{"$f":"IF('FICHE évaluateur'!$C$53=\"OUI\",1,0)","v":0},{"$f":"IF('FICHE évaluateur'!$C$55=\"OUI\",1,0)","v":0},{"$f":"'FICHE évaluateur'!$C$60","v":0},{"$f":"'FICHE évaluateur'!$C$62","v":0},{"$f":"IF('FICHE évaluateur'!$C$64=\"OUI\",1,0)","v":0},{"$f":"'FICHE évaluateur'!$C$66","v":0},{"$f":"IF('FICHE évaluateur'!$C$68=\"OUI\",1,0)","v":0},{"$f":"IF('FICHE évaluateur'!$C$70=\"OUI\",1,0)","v":0},{"$f":"IF('FICHE évaluateur'!$C$72=\"OUI\",1,0)","v":0},{"$f":"IF('FICHE évaluateur'!$C$74=\"OUI\",1,0)","v":0},{"$f":"IF('FICHE évaluateur'!$C$76=\"OUI\",1,0)","v":0},{"$f":"IF('FICHE évaluateur'!$C$81=\"OUI\",1,0)","v":0},{"$f":"IF('FICHE évaluateur'!$C$83=\"OUI\",1,0)","v":0},{"$f":"IF('FICHE évaluateur'!$C$85=\"NON\",1,0)","v":0},{"$f":"IF('FICHE évaluateur'!$C$90=\"OUI\",1,0)","v":0},{"$f":"IF('FICHE évaluateur'!$C$92=\"OUI\",1,0)","v":0},{"$f":"'FICHE évaluateur'!$C$94","v":0},{"$f":"'FICHE évaluateur'!$C$96","v":0},{"$f":"'FICHE évaluateur'!$C$98","v":0},{"$f":"'FICHE évaluateur'!$C$100","v":0},{"$f":"'FICHE évaluateur'!$C$102","v":0},{"$f":"IF('FICHE évaluateur'!$C$104=\"OUI\",1,0)","v":0},{"$f":"IF('FICHE évaluateur'!$C$106=\"OUI\",1,0)","v":0},{"$f":"'FICHE évaluateur'!$C$108","v":0},{"$f":"'FICHE évaluateur'!$C$110","v":0},{"$f":"IF('FICHE évaluateur'!$C$112=\"OUI\",1,0)","v":0},{"$f":"'FICHE évaluateur'!$A$132","v":0}]

{"sheet":"Feuil3","index":5,"n_rows":1438,"n_cols":14,"rows_kept":1438,"cut":false,"hidden":true,"merged":[]}
["Numéro","Club","Centre de gestion","Type de club",2017,"DISTRICT DE LA  CHARENTE",16,"Janvier ",1,null,null,"Entre 5 et 30 min",null,"Libre"]
[500021,"STADE BORDELAIS - ASPTT","DISTRICT DE LA GIRONDE","Libre",2018,"DISTRICT CHARENTE MARITIME",17,"Février",2,null,"X","Entre 30 min et 1h",null,"Féminin"]
[500042,"BORDEAUX ETUDIANTS C.","DISTRICT DE LA GIRONDE","Libre",2019,"DISTRICT DE LA CORREZE",19,"Mars",3,null,null,"Entre 1h et 2h",null,"Futsal"]
[500045,"C.ML FLOIRAC","DISTRICT DE LA GIRONDE","Libre",2020,"DISTRICT DE LA CREUSE",23,"Avril",4,null,null,"Plus de 2h",null,"Foot Entreprise"]
[500057,"SP.C. LA BASTIDIENNE","DISTRICT DE LA GIRONDE","Libre",2021,"DISTRICT FOOT DORDOGNE-PERIGORD",24,"Mai",5,null,null,null,null,"Jeune"]
[500060,"BORDEAUX A.C.","DISTRICT DE LA GIRONDE","Libre",2022,"DISTRICT DE LA GIRONDE",33,"Juin",6,null,null,null,null,"Groupement de Jeune"]
[500089,"O. FC. DE RUELLE","DISTRICT DE LA  CHARENTE","Libre",2023,"DISTRICT LANDES",40,"Juillet",7,null,null,null,null,"Loisirs"]
[500097,"ST. MONTOIS","DISTRICT LANDES","Libre",2024,"DISTRICT LOT ET GARONNE",47,"Août",8]
[500110,"C.A. BEGLAIS","DISTRICT DE LA GIRONDE","Libre",2025,"DISTRICT PYRENEES ATLANTIQUES",64,"Septembre",9]
[500111,"S.O. CHATELLERAULT","DISTRICT DE LA VIENNE","Libre",2026,"DISTRICT DES DEUX-SEVRES",79,"Octobre",10]
[500134,"S.C. ST JEAN D'ANGELY","DISTRICT CHARENTE MARITIME","Libre",2027,"DISTRICT DE LA VIENNE",86,"Novembre",11]
[500139,"ST. PESSACAIS U.C.","DISTRICT DE LA GIRONDE","Libre",2028,"DISTRICT HAUTE-VIENNE",87,"Décembre",12]
[500161,"U.S. CHATEAUNEUF","DISTRICT DE LA  CHARENTE","Libre",2029,null,null,null,13]
[500211,"F.C. GIRONDINS DE BORDEAUX","DISTRICT DE LA GIRONDE","Libre",2030,null,null,null,14]
[500246,"S.C. STE CROIX DU MONT","DISTRICT DE LA GIRONDE","Libre",null,null,null,null,15]
[500343,"S.C. DE CADAUJAC","DISTRICT DE LA GIRONDE","Libre",null,null,null,null,16]
[500370,"A.S. AIXE S/VIENNE","DISTRICT HAUTE-VIENNE","Libre",null,null,null,null,17]
[500440,"J. VILLENAVAISE","DISTRICT DE LA GIRONDE","Libre",null,null,null,null,18]
[500446,"SAINT MEDARD S. C.","DISTRICT DE LA GIRONDE","Libre",null,null,null,null,19]
[500451,"AV. DE MATHA","DISTRICT CHARENTE MARITIME","Libre",null,null,null,null,20]
{"$rows_left_out":1418}